﻿"Item Id","Item URI","Dublin Core:Alternative Title","Dublin Core:Abstract","Dublin Core:Table Of Contents","Dublin Core:Date Available","Dublin Core:Date Created","Dublin Core:Date Accepted","Dublin Core:Date Copyrighted","Dublin Core:Date Submitted","Dublin Core:Date Issued","Dublin Core:Date Modified","Dublin Core:Date Valid","Dublin Core:Access Rights","Dublin Core:License","Dublin Core:Conforms To","Dublin Core:Has Format","Dublin Core:Has Part","Dublin Core:Has Version","Dublin Core:Is Format Of","Dublin Core:Is Part Of","Dublin Core:Is Referenced By","Dublin Core:Is Replaced By","Dublin Core:Is Required By","Dublin Core:Is Version Of","Dublin Core:References","Dublin Core:Replaces","Dublin Core:Requires","Dublin Core:Extent","Dublin Core:Medium","Dublin Core:Bibliographic Citation","Dublin Core:Spatial Coverage","Dublin Core:Temporal Coverage","Dublin Core:Accrual Method","Dublin Core:Accrual Periodicity","Dublin Core:Accrual Policy","Dublin Core:Audience","Dublin Core:Audience Education Level","Dublin Core:Mediator","Dublin Core:Instructional Method","Dublin Core:Provenance","Dublin Core:Rights Holder","Dublin Core:Title","Dublin Core:Subject","Dublin Core:Description","Dublin Core:Creator","Dublin Core:Source","Dublin Core:Publisher","Dublin Core:Date","Dublin Core:Contributor","Dublin Core:Rights","Dublin Core:Relation","Dublin Core:Format","Dublin Core:Language","Dublin Core:Type","Dublin Core:Identifier","Dublin Core:Coverage","Item Type Metadata:Text","Item Type Metadata:Interviewer","Item Type Metadata:Interviewee","Item Type Metadata:Location","Item Type Metadata:Transcription","Item Type Metadata:Local URL","Item Type Metadata:Original Format","Item Type Metadata:Physical Dimensions","Item Type Metadata:Duration","Item Type Metadata:Compression","Item Type Metadata:Producer","Item Type Metadata:Director","Item Type Metadata:Bit Rate/Frequency","Item Type Metadata:Time Summary","Item Type Metadata:Email Body","Item Type Metadata:Subject Line","Item Type Metadata:From","Item Type Metadata:To","Item Type Metadata:CC","Item Type Metadata:BCC","Item Type Metadata:Number of Attachments","Item Type Metadata:Standards","Item Type Metadata:Objectives","Item Type Metadata:Materials","Item Type Metadata:Lesson Plan Text","Item Type Metadata:URL","Item Type Metadata:Event Type","Item Type Metadata:Participants","Item Type Metadata:Birth Date","Item Type Metadata:Birthplace","Item Type Metadata:Death Date","Item Type Metadata:Occupation","Item Type Metadata:Biographical Text","Item Type Metadata:Bibliography","Item Type Metadata:September 11 Email: Body","Item Type Metadata:September 11 Email: Date","Item Type Metadata:September 11 Email: To","Item Type Metadata:September 11 Email: From","Item Type Metadata:September 11 Email: CC","Item Type Metadata:September 11 Email: Subject","Item Type Metadata:LC Story: Story","Item Type Metadata:LC Story: Memory","Item Type Metadata:LC Story: Affects","Item Type Metadata:RC Story: Story","Item Type Metadata:RC Story: Response","Item Type Metadata:RC Story: RC Volunteer","Item Type Metadata:RC Story: RC Employee","Item Type Metadata:CAIR Story: Story","Item Type Metadata:SEIU Story: Story","Item Type Metadata:SEIU Story: Local Union","Item Type Metadata:TomPaine Story: Story","Item Type Metadata:VTMBH Article: Edition","Item Type Metadata:VTMBH Article: Article Order","Item Type Metadata:VTMBH Article: Title","Item Type Metadata:VTMBH Article: Author","Item Type Metadata:VTMBH Article: Publication","Item Type Metadata:VTMBH Article: Original Language","Item Type Metadata:VTMBH Article: Translator","Item Type Metadata:VTMBH Article: Section","Item Type Metadata:VTMBH Article: Blurb","Item Type Metadata:VTMBH Article: Keywords","Item Type Metadata:VTMBH Article: Body","Item Type Metadata:VTMBH Article: Line Breaks","Item Type Metadata:VTMBH Article: Date","Item Type Metadata:VTMBH Article: Thumb","Item Type Metadata:VTMBH Article: Article File","Item Type Metadata:VTMBH Article: Hit Count","Item Type Metadata:911DA Story: Story","Item Type Metadata:NMAH Story: Story","Item Type Metadata:NMAH Story: Life Changed","Item Type Metadata:NMAH Story: Remembered","Item Type Metadata:NMAH Story: Flag","Item Type Metadata:NMAH Card: Card Version","Item Type Metadata:NMAH Card: Image Available","Item Type Metadata:Chinatown Interview: Interviewee","Item Type Metadata:Chinatown Interview: Interviewer","Item Type Metadata:Chinatown Interview: Date","Item Type Metadata:Chinatown Interview: Language","Item Type Metadata:Chinatown Interview: Occupation","Item Type Metadata:Chinatown Interview: Interview (en)","Item Type Metadata:Chinatown Interview: Interview (zh)","Item Type Metadata:HINY Photo: Description","Item Type Metadata:HINY Photo: Notes","Item Type Metadata:HINY Photo: Caption","Item Type Metadata:HINY Photo: Submitted On","Item Type Metadata:HINY Photo: Category","Item Type Metadata:HINY Photo: Comment","Item Type Metadata:Sonic Memorial: Name","Item Type Metadata:Sonic Memorial: Source Ref Name","Item Type Metadata:Sonic Memorial: Comments","Item Type Metadata:Sonic Memorial: Source Type","Item Type Metadata:Sonic Memorial: Duration","Item Type Metadata:Sonic Memorial: Permission","Item Type Metadata:Sonic Memorial: Creation Date","Item Type Metadata:Sonic Memorial: Contact","Item Type Metadata:Sonic Memorial: Status","Item Type Metadata:Sonic Memorial: Is Browsable","Item Type Metadata:Sonic Memorial: Keyword","Item Type Metadata:How has your life changed because of what happened on September 11, 2001?","Item Type Metadata:Referred to by","Item Type Metadata:Description or Caption","Item Type Metadata:How should the U.S. remember the events on Sept 11?","Item Type Metadata:How should the U.S. remember the events of September 11?","Item Type Metadata:How will you remember the 10th anniversary of the September 11 attacks?","Item Type Metadata:911DA Story: Location on 9-11","Item Type Metadata:911DA Story: Contributor","Item Type Metadata:911DA Story: Date","911DA Item:Status","911DA Item:Consent","911DA Item:Posting","911DA Item:Copyright","911DA Item:Source","911DA Item:Media Type","911DA Item:Original Name","911DA Item:Created by Author","911DA Item:Described by Author","911DA Item:Date Entered","911DA Item:IP Address","911DA Item:Annotation","911DA Item:Notes","PDF Text:Text","911 Contributors Elements:What is your current zip code?","911 Contributors Elements:How old were you on September 11, 2001","Omeka Legacy File:Additional Creator","Omeka Legacy File:Transcriber","Omeka Legacy File:Producer","Omeka Legacy File:Render Device","Omeka Legacy File:Render Details","Omeka Legacy File:Capture Date","Omeka Legacy File:Capture Device","Omeka Legacy File:Capture Details","Omeka Legacy File:Change History","Omeka Legacy File:Watermark","Omeka Legacy File:Encryption","Omeka Legacy File:Compression","Omeka Legacy File:Post Processing","Omeka Image File:Width","Omeka Image File:Height","Omeka Image File:Bit Depth","Omeka Image File:Channels","Omeka Image File:Exif String","Omeka Image File:Exif Array","Omeka Image File:IPTC String","Omeka Image File:IPTC Array","Omeka Video File:Bitrate","Omeka Video File:Duration","Omeka Video File:Sample Rate","Omeka Video File:Codec","Omeka Video File:Width","Omeka Video File:Height","Contributor Elements:What is your current zip code?","Contributor Elements:How old were you on September 11, 2011?",tags,file,itemType,collection,public,featured
545,https://911digitalarchive.org/items/show/545,,,,,,,,,,,,,,,,,,,,,,,,,,,,,,,,,,,,,,,,,60.jpeg,,,,,,,,,,,,,,,,,,,,,,,,,,,,,,,,,,,,,,,,,,,,,,,,,,,,,,,,,,,,,,,,,,,,,,,,,,,,,,,,,,,,,,,,,,,,,,,,,,,,,,,,,,,,,,,,,,,,,,,,,,approved,full,yes,yes,"digital image","still image",vehicle4.jpg,yes,yes,2001-09-21,,,"""This image originates from www.thankyourescuers.com, file Rescuers""",,,,,,,,,,,,,,,,,,,,,,,,,,,,,,,,,,https://911digitalarchive.org/files/original/dce68c5df20e56cc4df851035b1d6cb5.jpg,,"Thank You Rescuers Still Images",1,0
544,https://911digitalarchive.org/items/show/544,,,,,,,,,,,,,,,,,,,,,,,,,,,,,,,,,,,,,,,,,52.jpeg,,,,,,,,,,,,,,,,,,,,,,,,,,,,,,,,,,,,,,,,,,,,,,,,,,,,,,,,,,,,,,,,,,,,,,,,,,,,,,,,,,,,,,,,,,,,,,,,,,,,,,,,,,,,,,,,,,,,,,,,,,approved,full,yes,yes,"digital image","still image",firemen4.jpg,yes,yes,2001-09-21,,,"""This image originates from www.thankyourescuers.com, file Rescuers""",,,,,,,,,,,,,,,,,,,,,,,,,,,,,,,,,,https://911digitalarchive.org/files/original/3a313a7de51e6ae0a1ebd74f5453fea2.jpg,,"Thank You Rescuers Still Images",1,0
543,https://911digitalarchive.org/items/show/543,,,,,,,,,,,,,,,,,,,,,,,,,,,,,,,,,,,,,,,,,15.jpeg,,,,,,,,,,,,,,,,,,,,,,,,,,,,,,,,,,,,,,,,,,,,,,,,,,,,,,,,,,,,,,,,,,,,,,,,,,,,,,,,,,,,,,,,,,,,,,,,,,,,,,,,,,,,,,,,,,,,,,,,,,approved,full,yes,yes,"digital image","still image",1_006.jpg,yes,yes,2001-09-21,,,"""This image originates from www.thankyouresuers.com, file Images of Devastation""",,,,,,,,,,,,,,,,,,,,,,,,,,,,,,,,,,https://911digitalarchive.org/files/original/4c471bc1e62d0519ee320feeec95be50.jpg,,"Thank You Rescuers Still Images",1,0
542,https://911digitalarchive.org/items/show/542,,,,,,,,,,,,,,,,,,,,,,,,,,,,,,,,,,,,,,,,,12.jpeg,,,,,,,,,,,,,,,,,,,,,,,,,,,,,,,,,,,,,,,,,,,,,,,,,,,,,,,,,,,,,,,,,,,,,,,,,,,,,,,,,,,,,,,,,,,,,,,,,,,,,,,,,,,,,,,,,,,,,,,,,,approved,full,yes,yes,"digital image","still image",1_009.jpg,yes,yes,2001-09-21,,,"""This image originates from www.thankyouresuers.com, file Images of Devastation""",,,,,,,,,,,,,,,,,,,,,,,,,,,,,,,,,,https://911digitalarchive.org/files/original/2a9a61221c2ed4ff497e43362de31795.jpg,,"Thank You Rescuers Still Images",1,0
541,https://911digitalarchive.org/items/show/541,,,,,,,,,,,,,,,,,,,,,,,,,,,,,,,,,,,,,,,,,41.jpeg,,"""Another rescuer with the right stuff I met on the """"pile"""". """,,,,,,,,,,,,,,,,,,,,,,,,,,,,,,,,,,,,,,,,,,,,,,,,,,,,,,,,,,,,,,,,,,,,,,,,,,,,,,,,,,,,,,,,,,,,,,,,,,,,,,,,,,,,,,,,,,,,,,,,approved,full,yes,yes,"digital image","still image",Civilianonpile.JPG,yes,yes,2002-10-02,,,"""This image originates from www.thankyourescuers.com, file Rescuers""",,,,,,,,,,,,,,,,,,,,,,,,,,,,,,,,,,https://911digitalarchive.org/files/original/7c5d4553652bf806ba0d628aeb701fcb.JPG,,"Thank You Rescuers Still Images",1,0
540,https://911digitalarchive.org/items/show/540,,,,,,,,,,,,,,,,,,,,,,,,,,,,,,,,,,,,,,,,,58.jpeg,,,,,,,,,,,,,,,,,,,,,,,,,,,,,,,,,,,,,,,,,,,,,,,,,,,,,,,,,,,,,,,,,,,,,,,,,,,,,,,,,,,,,,,,,,,,,,,,,,,,,,,,,,,,,,,,,,,,,,,,,,approved,full,yes,yes,"digital image","still image",vehicle6.jpg,yes,yes,2001-09-21,,,"""This image originates from www.thankyourescuers.com, file Rescuers""",,,,,,,,,,,,,,,,,,,,,,,,,,,,,,,,,,https://911digitalarchive.org/files/original/b1d032aca3bd65fa3fffd185d5bacc56.jpg,,"Thank You Rescuers Still Images",1,0
539,https://911digitalarchive.org/items/show/539,,,,,,,,,,,,,,,,,,,,,,,,,,,,,,,,,,,,,,,,,64.jpeg,,,,,,,,,,,,,,,,,,,,,,,,,,,,,,,,,,,,,,,,,,,,,,,,,,,,,,,,,,,,,,,,,,,,,,,,,,,,,,,,,,,,,,,,,,,,,,,,,,,,,,,,,,,,,,,,,,,,,,,,,,approved,full,yes,yes,"digital image","still image",vehicle1.jpg,yes,yes,2001-09-21,,,"""This image originates from www.thankyourescuers.com, file Rescuers""",,,,,,,,,,,,,,,,,,,,,,,,,,,,,,,,,,https://911digitalarchive.org/files/original/a540205468fa48c90efe25b88ad6e4d2.jpg,,"Thank You Rescuers Still Images",1,0
538,https://911digitalarchive.org/items/show/538,,,,,,,,,,,,,,,,,,,,,,,,,,,,,,,,,,,,,,,,,39.jpeg,,,,,,,,,,,,,,,,,,,,,,,,,,,,,,,,,,,,,,,,,,,,,,,,,,,,,,,,,,,,,,,,,,,,,,,,,,,,,,,,,,,,,,,,,,,,,,,,,,,,,,,,,,,,,,,,,,,,,,,,,,approved,full,yes,yes,"digital image","still image",barricade2.jpg,yes,yes,2001-09-21,,,"""This image originates from www.thankyourescuers.com, file People and Memorials""",,,,,,,,,,,,,,,,,,,,,,,,,,,,,,,,,,https://911digitalarchive.org/files/original/74f203d3de01129d0bc50e664ca2b909.jpg,,"Thank You Rescuers Still Images",1,0
537,https://911digitalarchive.org/items/show/537,,,,,,,,,,,,,,,,,,,,,,,,,,,,,,,,,,,,,,,,,50.jpeg,,,,,,,,,,,,,,,,,,,,,,,,,,,,,,,,,,,,,,,,,,,,,,,,,,,,,,,,,,,,,,,,,,,,,,,,,,,,,,,,,,,,,,,,,,,,,,,,,,,,,,,,,,,,,,,,,,,,,,,,,,approved,full,yes,yes,"digital image","still image",vehicle8.jpg,yes,yes,2001-09-21,,,"""This image originates from www.thankyourescuers.com, file Rescuers""",,,,,,,,,,,,,,,,,,,,,,,,,,,,,,,,,,https://911digitalarchive.org/files/original/63310c38d7a9d3298fab74718b2deeaf.jpg,,"Thank You Rescuers Still Images",1,0
536,https://911digitalarchive.org/items/show/536,,,,,,,,,,,,,,,,,,,,,,,,,,,,,,,,,,,,,,,,,29.jpeg,,,,,,,,,,,,,,,,,,,,,,,,,,,,,,,,,,,,,,,,,,,,,,,,,,,,,,,,,,,,,,,,,,,,,,,,,,,,,,,,,,,,,,,,,,,,,,,,,,,,,,,,,,,,,,,,,,,,,,,,,,approved,full,yes,yes,"digital image","still image",sign5.jpg,yes,yes,2001-09-21,,,"""This image originates from www.thankyourescuers.com, file People and Memorials""",,,,,,,,,,,,,,,,,,,,,,,,,,,,,,,,,,https://911digitalarchive.org/files/original/4dd8387a486e65dce011675c1e88c260.jpg,,"Thank You Rescuers Still Images",1,0
535,https://911digitalarchive.org/items/show/535,,,,,,,,,,,,,,,,,,,,,,,,,,,,,,,,,,,,,,,,,65.jpeg,,,,,,,,,,,,,,,,,,,,,,,,,,,,,,,,,,,,,,,,,,,,,,,,,,,,,,,,,,,,,,,,,,,,,,,,,,,,,,,,,,,,,,,,,,,,,,,,,,,,,,,,,,,,,,,,,,,,,,,,,,approved,full,yes,yes,"digital image","still image",policeman1.jpg,yes,yes,2001-09-21,,,"""This image originates from www.thankyourescuers.com, file Rescuers""",,,,,,,,,,,,,,,,,,,,,,,,,,,,,,,,,,https://911digitalarchive.org/files/original/5edd6ce7dc9c36270462e1cca7c254ff.jpg,,"Thank You Rescuers Still Images",1,0
534,https://911digitalarchive.org/items/show/534,,,,,,,,,,,,,,,,,,,,,,,,,,,,,,,,,,,,,,,,,48.jpeg,,"6th PCT POLICE OFFICERS WAITING TO RETURN TO THE RUBBLE! ",,,,,,,,,,,,,,,,,,,,,,,,,,,,,,,,,,,,,,,,,,,,,,,,,,,,,,,,,,,,,,,,,,,,,,,,,,,,,,,,,,,,,,,,,,,,,,,,,,,,,,,,,,,,,,,,,,,,,,,,approved,full,yes,yes,"digital image","still image","6TH PCT WTC.JPG",yes,yes,2001-12-03,,,"""This image originates from www.thankyourescuers.com, file Rescuers""",,,,,,,,,,,,,,,,,,,,,,,,,,,,,,,,,,https://911digitalarchive.org/files/original/9c454d6449824426d277d495173027e7.JPG,,"Thank You Rescuers Still Images",1,0
533,https://911digitalarchive.org/items/show/533,,,,,,,,,,,,,,,,,,,,,,,,,,,,,,,,,,,,,,,,,11.jpeg,,,,,,,,,,,,,,,,,,,,,,,,,,,,,,,,,,,,,,,,,,,,,,,,,,,,,,,,,,,,,,,,,,,,,,,,,,,,,,,,,,,,,,,,,,,,,,,,,,,,,,,,,,,,,,,,,,,,,,,,,,approved,full,yes,yes,"digital image","still image",1_010.jpg,yes,yes,2001-09-21,,,"""This image originates from www.thankyouresuers.com, file Images of Devastation""",,,,,,,,,,,,,,,,,,,,,,,,,,,,,,,,,,https://911digitalarchive.org/files/original/2c26e9e7743a171f8ee2676454937182.jpg,,"Thank You Rescuers Still Images",1,0
532,https://911digitalarchive.org/items/show/532,,,,,,,,,,,,,,,,,,,,,,,,,,,,,,,,,,,,,,,,,35.jpeg,,,,,,,,,,,,,,,,,,,,,,,,,,,,,,,,,,,,,,,,,,,,,,,,,,,,,,,,,,,,,,,,,,,,,,,,,,,,,,,,,,,,,,,,,,,,,,,,,,,,,,,,,,,,,,,,,,,,,,,,,,approved,full,yes,yes,"digital image","still image",emblem.jpg,yes,yes,2001-09-21,,,"""This image originates from www.thankyourescuers.com, file People and Memorials""",,,,,,,,,,,,,,,,,,,,,,,,,,,,,,,,,,https://911digitalarchive.org/files/original/3cec317e9f3642f230bd36ebc782d32a.jpg,,"Thank You Rescuers Still Images",1,0
531,https://911digitalarchive.org/items/show/531,,,,,,,,,,,,,,,,,,,,,,,,,,,,,,,,,,,,,,,,,31.jpeg,,,,,,,,,,,,,,,,,,,,,,,,,,,,,,,,,,,,,,,,,,,,,,,,,,,,,,,,,,,,,,,,,,,,,,,,,,,,,,,,,,,,,,,,,,,,,,,,,,,,,,,,,,,,,,,,,,,,,,,,,,approved,full,yes,yes,"digital image","still image",sign3.jpg,yes,yes,2001-09-21,,,"""This image originates from www.thankyourescuers.com, file People and Memorials""",,,,,,,,,,,,,,,,,,,,,,,,,,,,,,,,,,https://911digitalarchive.org/files/original/4dea6aae8ede90374c0414bff6f60fbc.jpg,,"Thank You Rescuers Still Images",1,0
530,https://911digitalarchive.org/items/show/530,,,,,,,,,,,,,,,,,,,,,,,,,,,,,,,,,,,,,,,,,10.jpeg,,"A view of ground zero from Jersey City ",,,,,,,,,,,,,,,,,,,,,,,,,,,,,,,,,,,,,,,,,,,,,,,,,,,,,,,,,,,,,,,,,,,,,,,,,,,,,,,,,,,,,,,,,,,,,,,,,,,,,,,,,,,,,,,,,,,,,,,,approved,full,yes,yes,"digital image","still image","View from Jersey City Docs.JPG",yes,yes,2001-09-21,,,"""This image originates from www.thankyouresuers.com, file Images of Devastation""",,,,,,,,,,,,,,,,,,,,,,,,,,,,,,,,,,https://911digitalarchive.org/files/original/7bed4d2aa828aaf6ebdcb7d1502b1a5f.JPG,,"Thank You Rescuers Still Images",1,0
529,https://911digitalarchive.org/items/show/529,,,,,,,,,,,,,,,,,,,,,,,,,,,,,,,,,,,,,,,,,20.jpeg,,,,,,,,,,,,,,,,,,,,,,,,,,,,,,,,,,,,,,,,,,,,,,,,,,,,,,,,,,,,,,,,,,,,,,,,,,,,,,,,,,,,,,,,,,,,,,,,,,,,,,,,,,,,,,,,,,,,,,,,,,approved,full,yes,yes,"digital image","still image",1_001.jpg,yes,yes,2001-09-21,,,"""This image originates from www.thankyouresuers.com, file Images of Devastation""",,,,,,,,,,,,,,,,,,,,,,,,,,,,,,,,,,https://911digitalarchive.org/files/original/30140dea1fefdc903ac49a882e623bb9.jpg,,"Thank You Rescuers Still Images",1,0
528,https://911digitalarchive.org/items/show/528,,,,,,,,,,,,,,,,,,,,,,,,,,,,,,,,,,,,,,,,,61.jpeg,,,,,,,,,,,,,,,,,,,,,,,,,,,,,,,,,,,,,,,,,,,,,,,,,,,,,,,,,,,,,,,,,,,,,,,,,,,,,,,,,,,,,,,,,,,,,,,,,,,,,,,,,,,,,,,,,,,,,,,,,,approved,full,yes,yes,"digital image","still image",vehicle3.jpg,yes,yes,2001-09-21,,,"""This image originates from www.thankyourescuers.com, file Rescuers""",,,,,,,,,,,,,,,,,,,,,,,,,,,,,,,,,,https://911digitalarchive.org/files/original/a4ceeeb4380d3bd9e5a7b4e9a15f6dbb.jpg,,"Thank You Rescuers Still Images",1,0
527,https://911digitalarchive.org/items/show/527,,,,,,,,,,,,,,,,,,,,,,,,,,,,,,,,,,,,,,,,,57.jpeg,,,,,,,,,,,,,,,,,,,,,,,,,,,,,,,,,,,,,,,,,,,,,,,,,,,,,,,,,,,,,,,,,,,,,,,,,,,,,,,,,,,,,,,,,,,,,,,,,,,,,,,,,,,,,,,,,,,,,,,,,,approved,full,yes,yes,"digital image","still image",vehicle9.jpg,yes,yes,2001-09-21,,,"""This image originates from www.thankyourescuers.com, file Rescuers""",,,,,,,,,,,,,,,,,,,,,,,,,,,,,,,,,,https://911digitalarchive.org/files/original/d2c2e799af313e85b1098ddfc7d6d533.jpg,,"Thank You Rescuers Still Images",1,0
526,https://911digitalarchive.org/items/show/526,,,,,,,,,,,,,,,,,,,,,,,,,,,,,,,,,,,,,,,,,27.jpeg,,"Hundreds of people go to load the boats in Jersey City to help the rescue workers. ",,,,,,,,,,,,,,,,,,,,,,,,,,,,,,,,,,,,,,,,,,,,,,,,,,,,,,,,,,,,,,,,,,,,,,,,,,,,,,,,,,,,,,,,,,,,,,,,,,,,,,,,,,,,,,,,,,,,,,,,approved,full,yes,yes,"digital image","still image","Helping Out.JPG",yes,yes,2001-09-21,,,"""This image originates from www.thankyourescuers.com, file People and Memorials""",,,,,,,,,,,,,,,,,,,,,,,,,,,,,,,,,,https://911digitalarchive.org/files/original/8b76247311b1f8c3cb168078ca09bc78.JPG,,"Thank You Rescuers Still Images",1,0
